{"text_format":"1","workbook":"xlsx","n_sheets":6,"sheets":["Info en versiebeheer","Invoer en Uitvoer","Input and Output","Berekening","Legaliteit","Variabelen"],"not_rendered":{"charts":0,"images":1,"macros":1,"external_links":0,"defined_names":23,"comments":0,"pivot_tables":0},"unopened":[],"bounds":{"document_bytes":16777216,"sheet_cells":100000,"rows_first":2000,"rows_last":500,"rows_between":2000,"halvings":0,"cell_chars":16384,"cell_head_chars":4096},"cells_cut":0,"cells_raw":0,"read":"whole","date_system":"1900"}

{"sheet":"Info en versiebeheer","index":0,"n_rows":48,"n_cols":6,"rows_kept":48,"cut":false,"hidden":true,"merged":[]}
["Info en Versiebeheer"]
[]
["Datum",{"$f":"TODAY()","v":"2025-12-12"}]
["Door","Ferry Goike"]
["Review","Henk van Heuveln"]
["Fondsnaam","PME"]
["Doel van de sheet","Berekening van ANW premies voor werkgevers"]
["Gebaseerd op Pensioenreglement","Pensioenreglement PME 1-1-2026"]
["Datum vaststelling reglement","2026-01-01"]
["Versienummer","1.0 - 2026"]
[]
["Werkwijze:"]
["Alle werkbladen worden beveiligd"]
["De sheet komt in directory waar alleen Actuariaat schrijfrechten op heeft, rest van TKP heeft alleen leesrechten"]
["De sheet is geschikt vanaf 1-1-2021."]
["In de sheet moet bij de invoer het verzekerd bedrag worden ingevuld."]
["Daarnaast moet er een geboortedatum van de deelnemer/partner worden ingevuld. "]
["De sheet zal d.m.v. de geboortedatum een burgelijke leeftijd op 1 januari, toetreding regeling of ingang relatie berekenen. Ferry checken a.u.b."]
["De sheet berekent de premie voor een heel jaar (het jaar waarin de berekendatum ligt). Daarnaast wordt ook een bedrag berekend in maanden en 4wk. "]
["Op deze manier is het voor de werkgever inzichtelijk wat de ANW-verzekering op jaar/maand/4wk basis aan premie kost."]
["Tabblad \"Variabelen\" bevat de premietarieven en opslagen; dit moet periodiek worden bijgewerkt"]
["N.B. voor de versie van de sheet die op de website komt: alleen tabblad Invoer en Uitvoer zichtbaar maken en legaliteit op 1 zetten."]
["Voor het tabblad Batch Invoer en Uitvoer dient het pensioennummer te worden gevuld"]
["om een berekening te maken voor de deelnemer. Met de knop wordt de batch berekend."]
["Let op! Bij een jaarovergang (nieuwe bedragen) moet ook de macro (Module4) worden aangepast!"]
[]
["Versienummer","Wijzigingen (korte omschrijving van de aanpassing)","Datum","Auteur","JIRA-melding","Controleur"]
[1,"Aanmaak van een sheet berekening van ANW premies voor werkgevers/werknemers","2021-08-13","Jeroen Achterhof"]
["1.1","Opmaak bedragen, ingangsdatum >= VANDAAG() - 3mnd, delete/print knop","2021-10-08","Jeroen Achterhof"]
[1,"Tarieven en bedragen per 01-01-2022 ingevoerd","2021-12-14","Ferry Goike"]
["1.1 ","Batch tabblad toegevoegd","2022-01-04","Jeroen Achterhof"]
["1.2","Format bedragen aangepast","2002-01-12","Ferry Goike"]
["1.3","Validatie geboortedatum partner aangepast","2022-04-28","Ferry Goike"]
["1.4","Batch invoer aangepast, keuzemogelijkheid periode","2022-05-31","Jeroen Achterhof",null,"Luuk Keizer"]
["1.5","Alle output terug geplaatst","2022-08-02","Jeroen Achterhof",null,"Luuk Keizer"]
["1.6","Nieuwe AOWlftd 67 3 mnd","2022-11-23","Jeroen Achterhof",null,"Patricia Woudstra/Ben Geense"]
["2023 - 1.0","Bedragen en tarieven per 01-01-2023","2022-11-23","Ferry Goike",null,"Patricia Woudstra/Bart van der Kooi"]
["2023 - 1.1","Invoer datum 2023 op batch sheet was niet mogelijk","2023-02-14","Jeroen Achterhof",null,"Patricia Woudstra/Bart van der Kooi"]
["2023 - 1.20","Toevoeging Engelse tabblad Input and Output & Legaliteit aangepast","2023-04-03","Jeffrey Holtrop",null,"Rutger de Boer / Patricia Woudstra"]
["2023 - 1.21","Kolom H tabblad Berekening uitgebreid. Cel E6 tabblad Input and Output naamgeving aangepast.","2023-05-31","Jeffrey Holtrop",null,"Patricia Woudstra"]
["2023 - 1.22","Tabblad Variabelen cel B19 aangepast.","2023-06-21","Jeffrey Holtrop",null,"Patricia Woudstra / Elske de Ruiter"]
["2023 - 1.23","Einde verzekering partner met 1 maand verlaagd, tabblad Variabelen cel B19.","2023-06-26","Jeffrey Holtrop",null,"Patricia Woudstra / Elske de Ruiter"]
["2023 - 1.24 -> 2.0","Einde verzekering partner met 1 maand verhoogd t.o.v. versie 1.22, tabblad Variabelen cel B19.","2023-07-05","Jeffrey Holtrop",null,"Patricia Woudstra / Elske de Ruiter"]
["2023 - 3.0","\"S:\\Pensioenuitvoering_rekensheets_pme\\\" werkzaam gemaakt in tabblad [Legaliteit]","2023-10-26","Ferry Goike",null,"Patricia Woudstra"]
["2024  - 1.0","Tarieven en bedragen per 01-01-2024 ingevoerd","2023-11-27","Ferry Goike",null,"Patricia Woudstra / Elske de Ruiter"]
["2024  - 2.0","Batch tabblad aangepast naar 2024","2023-11-27","Ferry Goike",null,"Alen Buzimkic / Elske de Ruiter"]
["2025  - 1.0","Tarieven en bedragen per 01-01-2025 ingevoerd en batch tabblad aangepast naar 2025","2024-11-20","Ferry Goike","https://tkppensioen.atlassian.net/browse/FLEX-1342","Patricia Tiktak-Woudstra / Wietske Hooghiemstra"]
["2026  - 1.0","Tarieven en bedragen per 01-01-2026 ingevoerd en batch tabblad aangepast naar 2026. Bedragen in Module4 aangepast.","2025-11-21","Ferry Goike","https://tkppensioen.atlassian.net/browse/FLEX-1466","Patricia Tiktak-Woudstra / Wietske Hooghiemstra"]

{"sheet":"Invoer en Uitvoer","index":1,"n_rows":20,"n_cols":5,"rows_kept":20,"cut":false,"hidden":false,"merged":[[8,4,9,7],[5,4,5,7]]}
[]
["Invoer:"]
[]
[null,"Ingangsdatum ANW:"]
[null,"Naam deelnemer:"]
[null,"Pensioennr deelnemer:",null,null,"berekening premie Anw-hiaatpensioen 2026"]
[null,"Geboortedatum deelnemer:"]
[null,"Geboortedatum partner:"]
[null,"Verzekerd bedrag:",null,null,{"$f":"\"Voor nieuwe deelnemers zijn er vanaf 1-1-2026 drie ANW-hiaat bedragen te kiezen: € 9.700, € 15.600 en € 21.500\"","v":"Voor nieuwe deelnemers zijn er vanaf 1-1-2026 drie ANW-hiaat bedragen te kiezen: € 9.700, € 15.600 en € 21.500"}]
[]
[]
[]
[]
[]
[]
["Uitvoer:","Brutopremie per jaar:",{"$f":"IFERROR(Berekening!B23*Legaliteit,\"\")","v":""}]
[null,"Brutopremie per maand:",{"$f":"IFERROR(Berekening!B24*Legaliteit,\"\")","v":""}]
[null,"Brutopremie per 4wk:",{"$f":"IFERROR(Berekening!B25*Legaliteit,\"\")","v":""}]
[null,{"$f":"Berekening!A15","v":"factor koopsom (leeftijd partner)"},{"$f":"Berekening!B15","v":0}]
[null,{"$f":"Berekening!A16","v":"factor premie (leeftijd deelnemer)"},{"$f":"Berekening!B16","v":{"$error":"#N/A"}}]

{"sheet":"Input and Output","index":2,"n_rows":20,"n_cols":5,"rows_kept":20,"cut":false,"hidden":false,"merged":[[5,4,5,7],[8,4,9,7]]}
[]
["Input:"]
[]
[null,"Commencement date ANW:"]
[null,"Name participant:"]
[null,"Pension number participant:",null,null,"Calculation premium additional partner pension (Anw gap) 2026"]
[null,"Date of birth participant:"]
[null,"Date of birth partner:"]
[null,"Insured amount:",null,null,{"$f":"\"For new participants there are three Anw gap pension amounts to choose from as of 1-1-2026: € 9,700, € 15,600 and € 21,500\"","v":"For new participants there are three Anw gap pension amounts to choose from as of 1-1-2026: € 9,700, € 15,600 and € 21,500"}]
[]
[]
[]
[]
[]
[]
["Output:","Gross premium per year:",{"$f":"IFERROR(Berekening!H23*Legaliteit,\"\")","v":""}]
[null,"Gross premium per month:",{"$f":"IFERROR(Berekening!H24*Legaliteit,\"\")","v":""}]
[null,"Gross premium per 4 weeks:",{"$f":"IFERROR(Berekening!H25*Legaliteit,\"\")","v":""}]
[null,{"$f":"Berekening!A15","v":"factor koopsom (leeftijd partner)"},{"$f":"Berekening!B15","v":0}]
[null,{"$f":"Berekening!A16","v":"factor premie (leeftijd deelnemer)"},{"$f":"Berekening!B16","v":{"$error":"#N/A"}}]

{"sheet":"Berekening","index":3,"n_rows":25,"n_cols":9,"rows_kept":25,"cut":false,"hidden":true,"merged":[]}
["Rekendatum:",{"$f":"rekdat","v":"00:00:00"},{"$f":"IF(B1<Variabelen!B21,0,1)","v":0},null,null,"Engelse variant:","Commence Date",{"$f":"Commencedate","v":"00:00:00"},{"$f":"IF(H1<Variabelen!B21,0,1)","v":0}]
[]
[]
[{"$f":"'Invoer en Uitvoer'!B5","v":"Naam deelnemer:"},{"$f":"'Invoer en Uitvoer'!C5","v":0},null,null,null,null,{"$f":"'Input and Output'!B5","v":"Name participant:"},{"$f":"'Input and Output'!C5","v":0}]
[{"$f":"'Invoer en Uitvoer'!B6","v":"Pensioennr deelnemer:"},{"$f":"'Invoer en Uitvoer'!C6","v":0},null,null,null,null,{"$f":"'Input and Output'!B6","v":"Pension number participant:"},{"$f":"'Input and Output'!C6","v":0}]
[{"$f":"'Invoer en Uitvoer'!B7","v":"Geboortedatum deelnemer:"},{"$f":"'Invoer en Uitvoer'!C7","v":"00:00:00"},{"$f":"IF(AND(B6>=Variabelen!D19,B6<=Variabelen!D20),1,0)","v":0},null,null,null,{"$f":"'Input and Output'!B7","v":"Date of birth participant:"},{"$f":"'Input and Output'!C7","v":"00:00:00"},{"$f":"IF(AND(H6>=Variabelen!D19,H6<=Variabelen!D20),1,0)","v":0}]
[{"$f":"'Invoer en Uitvoer'!B8","v":"Geboortedatum partner:"},{"$f":"'Invoer en Uitvoer'!C8","v":"00:00:00"},{"$f":"IF(AND(B7>=Variabelen!B19,B7<=Variabelen!B20),1,0)","v":0},null,null,null,{"$f":"'Input and Output'!B8","v":"Date of birth partner:"},{"$f":"'Input and Output'!C8","v":"00:00:00"},{"$f":"IF(AND(H7>=Variabelen!B19,H7<=Variabelen!B20),1,0)","v":0}]
[{"$f":"'Invoer en Uitvoer'!B9","v":"Verzekerd bedrag:"},{"$f":"'Invoer en Uitvoer'!C9","v":0},null,null,null,null,{"$f":"'Input and Output'!B9","v":"Insured amount:"},{"$f":"'Input and Output'!C9","v":0}]
["b_Verzekerd bedrag:",{"$f":"IF(ISNUMBER(MATCH(B8,Variabelen!B15:B17,0)),1,0)","v":0},{"$f":"IF(ISNUMBER(MATCH(B8,Variabelen!B15:B17,0)),1,0)","v":0},null,null,null,"Insured amount:",{"$f":"IF(ISNUMBER(MATCH(H8,Variabelen!B15:B17,0)),1,0)","v":0},{"$f":"IF(ISNUMBER(MATCH(H8,Variabelen!B15:B17,0)),1,0)","v":0}]
[]
[]
["Burgerlijke leeftijd deelnemer op 1 januari:",{"$f":"YEAR(B1)-YEAR(B6)-IF(AND(MONTH(B6)=1,DAY(B6)=1),0,1)","v":-1},null,null,null,null,"Age participant on the 1st of januari:",{"$f":"YEAR(H1)-YEAR(H6)-IF(AND(MONTH(H6)=1,DAY(H6)=1),0,1)","v":-1}]
["Burgerlijke leeftijd partner op 1 januari:",{"$f":"YEAR(B1)-YEAR(B7)-IF(AND(MONTH(B7)=1,DAY(B7)=1),0,1)","v":-1},null,null,null,null,"Age partner on the 1st of januari:",{"$f":"YEAR(H1)-YEAR(H7)-IF(AND(MONTH(H7)=1,DAY(H7)=1),0,1)","v":-1}]
[]
["factor koopsom (leeftijd partner)",{"$f":"IFERROR(VLOOKUP(B13,Variabelen!$A$25:$E$90,2,0),0)","v":0},null,null,null,null,"factor purchase price (age partner)",{"$f":"IFERROR(VLOOKUP(H13,Variabelen!$A$25:$E$90,2,0),0)","v":0}]
["factor premie (leeftijd deelnemer)",{"$f":"VLOOKUP(B12,Variabelen!$A$25:$E$90,3,0)","v":{"$error":"#N/A"}},null,null,null,null,"factor purchase price (age participant)",{"$f":"VLOOKUP(H12,Variabelen!$A$25:$E$90,3,0)","v":{"$error":"#N/A"}}]
[]
["OVL risicokapitaal:",{"$f":"B15*B8","v":0},null,null,null,null,"Death risk capital:",{"$f":"H15*H8","v":0}]
["OVL risicokapitaal / 1000:",{"$f":"B18/1000","v":0},null,null,null,null,"Death risk capital / 1000:",{"$f":"H18/1000","v":0}]
[null,null,{"$f":"C6*C7*C9","v":0},null,null,null,null,null,{"$f":"I6*I7*I9","v":0}]
[]
[]
["Premie per jaar",{"$f":"B19*B16*C20","v":{"$error":"#N/A"}},null,{"$f":"B19*B16*C20","v":{"$error":"#N/A"}},null,null,"Gross premium per year:",{"$f":"H19*H16*I20","v":{"$error":"#N/A"}}]
["Premie per maand",{"$f":"(B23/12)*C20","v":{"$error":"#N/A"}},null,null,null,null,"Gross premium per month:",{"$f":"(H23/12)*I20","v":{"$error":"#N/A"}}]
["Premie per 4wk",{"$f":"(B23/13)*C20","v":{"$error":"#N/A"}},null,null,null,null,"Gross premium per 4 weeks:",{"$f":"(H23/13)*I20","v":{"$error":"#N/A"}}]

{"sheet":"Legaliteit","index":4,"n_rows":25,"n_cols":2,"rows_kept":25,"cut":false,"hidden":true,"merged":[]}
["Dit tabblad wordt verborgen"]
["Op het tabblad Legaliteit komen de toegestane paden te staan"]
["Staat de sheet op een andere locatie dan worden de uitkomsten met nul vermenigvuldigd"]
[]
["Naam sheet: ","PME_ANW Premie berekening_2026 versie 1.0"]
[]
[]
["Toegestane locaties"]
["S:\\Pensioenuitvoering_Rekensheets\\Algemene rekensheets\\",{"$f":"A9&\"[\"&$B$5&\".xlsm]Legaliteit\"","v":"S:\\Pensioenuitvoering_Rekensheets\\Algemene rekensheets\\[PME_ANW Premie berekening_2026 versie 1.0.xlsm]Legaliteit"}]
["S:\\Deelnemersdesk_Testversies_rekensheets_Seniordesk\\Algemeen\\",{"$f":"A10&\"[\"&$B$5&\".xlsm]Legaliteit\"","v":"S:\\Deelnemersdesk_Testversies_rekensheets_Seniordesk\\Algemeen\\[PME_ANW Premie berekening_2026 versie 1.0.xlsm]Legaliteit"}]
["S:\\Deelnemersdesk_Testversies_rekensheets_Seniordesk\\PME\\","S:\\Deelnemersdesk_Testversies_rekensheets_Seniordesk\\PME\\[PME_ANW Premie berekening_2026 versie 1.0.xlsm]Legaliteit"]
["S:\\Pensioenuitvoering_Rekensheets\\PME\\","S:\\Pensioenuitvoering_Rekensheets\\PME\\[PME_ANW Premie berekening_2026 versie 1.0.xlsm]Legaliteit"]
["S:\\Pensioenuitvoering_rekensheets_pme\\","S:\\Pensioenuitvoering_rekensheets_pme\\[PME_ANW Premie berekening_2026 versie 1.0.xlsm]Legaliteit"]
["X:\\Finance\\Actuariaat\\Fondsen\\PME\\Rekensheets en berekeningen\\Individuele berekeningen\\ANW premie\\",{"$f":"A14&\"[\"&$B$5&\".xlsm]Legaliteit\"","v":"X:\\Finance\\Actuariaat\\Fondsen\\PME\\Rekensheets en berekeningen\\Individuele berekeningen\\ANW premie\\[PME_ANW Premie berekening_2026 versie 1.0.xlsm]Legaliteit"}]
["X:\\PenI\\PME\\003 Reglementen\\Premie Rekensheets","X:\\PenI\\PME\\003 Reglementen\\Premie Rekensheets[PME_ANW Premie berekening_2026 versie 1.0.xlsm]Legaliteit"]
["S:\\Pensioenuitvoering_Rekensheets\\PME\\archief\\","S:\\Pensioenuitvoering_Rekensheets\\PME\\archief\\[PME_ANW Premie berekening_2026 versie 1.0.xlsm]Legaliteit"]
["S:\\Deelnemersdesk_PME\\","S:\\Deelnemersdesk_PME\\[PME_ANW Premie berekening_2026 versie 1.0.xlsm]Legaliteit"]
["S:\\Pensioenuitvoering_Rekensheets\\PME\\Obbing.t\\Testmap\\","S:\\Pensioenuitvoering_Rekensheets\\PME\\Obbing.t\\Testmap\\[PME_ANW Premie berekening_2026 versie 1.0.xlsm]Legaliteit"]
["S:\\Pensioenuitvoering_Rekensheets\\PME\\Dorren.m\\Testmap\\","S:\\Pensioenuitvoering_Rekensheets\\PME\\Dorren.m\\Testmap\\[PME_ANW Premie berekening_2026 versie 1.0.xlsm]Legaliteit"]
["S:\\Pensioenuitvoering_rekensheets_pme\\Obbing.t\\Testmap\\","S:\\Pensioenuitvoering_rekensheets_pme\\Obbing.t\\Testmap\\[PME_ANW Premie berekening_2026 versie 1.0.xlsm]Legaliteit"]
["S:\\Pensioenuitvoering_rekensheets_pme\\Dorren.m\\Testmap\\","S:\\Pensioenuitvoering_rekensheets_pme\\Dorren.m\\Testmap\\[PME_ANW Premie berekening_2026 versie 1.0.xlsm]Legaliteit"]
[]
["Huidige Locatie ",{"$f":"CELL(\"bestandsnaam\",A1)","v":"X:\\Finance\\Actuariaat\\Fondsen\\PME\\Rekensheets en berekeningen\\Individuele berekeningen\\ANW premie\\[PME_ANW Premie berekening_2026 versie 1.0.xlsm]Legaliteit"}]
[]
[null,1]

{"sheet":"Variabelen","index":5,"n_rows":816,"n_cols":12,"rows_kept":816,"cut":false,"hidden":true,"merged":[]}
["PME"]
["Bron: "]
["versienummer:","1.0 - 2026",null,null,null,null,"AOW Leeftijd"]
["datum:","2025-11-21",null,null,null,null,"Geboren uiterlijk","AOW-leeftijd","Aanvangsleeftijd",null,"Geboortedatum","AOW"]
["door: ","Ferry Goike",null,null,null,null,"2023-12-31",67.25,17,null,"1900-01-01",{"$f":"H16","v":65}]
["review:",null,null,null,null,null,"1960-12-31",67,17,null,{"$f":"G16+1","v":"1948-01-01"},{"$f":"H15","v":65.083333333333329}]
[null,null,null,null,null,null,"1957-02-28",66.8333333333333,16.8333333333333,null,{"$f":"G15+1","v":"1948-12-01"},{"$f":"H14","v":65.166666666666671}]
[null,null,null,null,null,null,"1956-05-31",66.5833333333333,16.5833333333333,null,{"$f":"G14+1","v":"1949-11-01"},{"$f":"H13","v":65.25}]
["Opslagen","excasso","solvabiliteit","pvi",null,null,"1955-08-31",66.333333333333329,16.333333333333329,null,{"$f":"G13+1","v":"1950-10-01"},{"$f":"H12","v":65.5}]
["2026-01-01",null,null,null,null,null,"1952-12-31",66,16,null,{"$f":"G12+1","v":"1951-07-01"},{"$f":"H11","v":65.75}]
[null,null,null,null,null,null,"1952-03-31",65.75,15.75,null,{"$f":"G11+1","v":"1952-04-01"},{"$f":"H10","v":66}]
[null,null,null,null,null,null,"1951-06-30",65.5,15.5,null,{"$f":"G10+1","v":"1953-01-01"},{"$f":"H9","v":66.333333333333329}]
[null,null,null,null,null,null,"1950-09-30",65.25,15.25,null,{"$f":"G9+1","v":"1955-09-01"},{"$f":"H8","v":66.5833333333333}]
[null,null,null,null,null,null,"1949-10-31",65.166666666666671,15.166666666666671,null,{"$f":"G8+1","v":"1956-06-01"},{"$f":"H7","v":66.8333333333333}]
["Hoogte ANW optie 1",21500,null,{"$f":"YEAR(rekdat)","v":1900},null,null,"1948-11-30",65.083333333333329,15.083333333333329,null,{"$f":"G7+1","v":"1957-03-01"},{"$f":"H6","v":67}]
["Hoogte ANW optie 2",15600,null,null,null,null,"1947-12-31",65,15,null,{"$f":"G6+1","v":"1961-01-01"},{"$f":"H5","v":67.25}]
["Hoogte ANW optie 3",9700]
[null,null,null,null,null,null,null,null,null,null,"AOW-leeftijd partner",{"$f":"VLOOKUP('Invoer en Uitvoer'!$C$8,$K$6:$L$16,2,TRUE)","v":{"$error":"#N/A"}}]
["Maximale geboortedatum partner 2026",{"$f":"IF(GeboortedatumPartner<DATE(1948,1,1),DATE(YEAR(rekdat)-64,MONTH(rekdat)-10,DAY(rekdat)),\nIF(GeboortedatumPartner<DATE(1948,12,1),DATE(YEAR(rekdat)-64,MONTH(rekdat)-11,DAY(rekdat)),\nIF(GeboortedatumPartner<DATE(1949,11,1),DATE(YEAR(rekdat)-65,MONTH(rekdat),DAY(rekdat)),\nIF(GeboortedatumPartner<DATE(1950,10,1),DATE(YEAR(rekdat)-65,MONTH(rekdat)-1,DAY(rekdat)),\nIF(GeboortedatumPartner<DATE(1951,7,1),DATE(YEAR(rekdat)-65,MONTH(rekdat)-4,DAY(rekdat)),\nIF(GeboortedatumPartner<DATE(1952,4,1),DATE(YEAR(rekdat)-65,MONTH(rekdat)-7,DAY(rekdat)),\nIF(GeboortedatumPartner<DATE(1953,1,1),DATE(YEAR(rekdat)-65,MONTH(rekdat)-10,DAY(rekdat)),\nIF(GeboortedatumPartner<DATE(1955,9,1),DATE(YEAR(rekdat)-66,MONTH(rekdat)-2,DAY(rekdat)),\nIF(GeboortedatumPartner<DATE(1956,6,1),DATE(YEAR(rekdat)-66,MONTH(rekdat)-5,DAY(rekdat)),\nIF(GeboortedatumPartner<DATE(1957,3,1),DATE(YEAR(rekdat)-66,MONTH(rekdat)-8,DAY(rekdat)),\nIF(GeboortedatumPartner<DATE(1961,1,1),DATE(YEAR(rekdat)-66,MONTH(rekdat)-10,DAY(rekdat)),DATE(YEAR(rekdat)-67,MONTH(rekdat)-1,DAY(rekdat)))))))))))))","v":"3735-02-28"},"Maximale geboortedatum deelnemer 2026",{"$f":"DATE(YEAR(rekdat)-80,MONTH(rekdat),1)","v":"3720-01-01"},null,null,null,null,null,null,"AOW-leeftijd jaar",{"$f":"INT(L18)","v":{"$error":"#N/A"}}]
["Minimale geboortedatum partner 2026",{"$f":"DATE(YEAR(rekdat)-15,MONTH(rekdat),1)","v":"3785-01-01"},"Minimale geboortedatum deelnemer 2026",{"$f":"DATE(YEAR(rekdat)-18,MONTH(rekdat),1)","v":"3782-01-01"},null,null,null,null,null,null,"AOW-leeftijd maand",{"$f":"(L18-L19)*12","v":{"$error":"#N/A"}}]
["Minimale Ingangsdatum",{"$f":"DATE(YEAR(TODAY()),MONTH(TODAY())-3,1)","v":"2025-09-01"},null,null,null,null,null,null,null,null,"AOW-datum partner",{"$f":"DATE(YEAR('Invoer en Uitvoer'!$C$8)+Variabelen!$L$19,MONTH('Invoer en Uitvoer'!$C$8)+Variabelen!$L$20,1)","v":{"$error":"#N/A"}}]
["premie"]
[]
["leeftijd","koopsomtarief (gebaseerd op leeftijd partner op 1-1)","premietarief (gebaseerd op leeftijd deelnemer op 1-1)",null,"Leeftijd maanden","koopsomtarief (gebaseerd op leeftijd partner op 1-1)","premietarief (gebaseerd op leeftijd deelnemer op 1-1)"]
[15,32.630000000000003,0.06,null,180,{"$f":"VLOOKUP(ROUNDDOWN($E25/12,0),$A$25:$C$90,2,0)","v":32.630000000000003},{"$f":"VLOOKUP(ROUNDDOWN($E25/12,0),$A$25:$C$90,3,0)","v":0.06}]
[16,32.299999999999997,0.09,null,181,{"$f":"VLOOKUP(ROUNDDOWN($E26/12,0),$A$25:$C$90,2,0)","v":32.630000000000003},{"$f":"VLOOKUP(ROUNDDOWN($E26/12,0),$A$25:$C$90,3,0)","v":0.06}]
[17,31.962,0.1,null,182,32.630000000000003,0.06]
[18,31.619,0.12,null,183,32.630000000000003,0.06]
[19,31.266999999999999,0.15,null,184,32.630000000000003,0.06]
[20,30.908999999999999,0.16,null,185,32.630000000000003,0.06]
[21,30.542999999999999,0.17,null,186,32.630000000000003,0.06]
[22,30.17,0.17,null,187,32.630000000000003,0.06]
[23,29.788,0.19,null,188,32.630000000000003,0.06]
[24,29.399000000000001,0.19,null,189,32.630000000000003,0.06]
[25,29.001000000000001,0.2,null,190,32.630000000000003,0.06]
[26,28.594999999999999,0.21,null,191,32.630000000000003,0.06]
[27,28.181000000000001,0.2,null,192,32.299999999999997,0.09]
[28,27.757999999999999,0.22,null,193,32.299999999999997,0.09]
[29,27.292000000000002,0.23,null,194,32.299999999999997,0.09]
[30,26.780999999999999,0.23,null,195,32.299999999999997,0.09]
[31,26.33,0.26,null,196,32.299999999999997,0.09]
[32,25.867999999999999,0.27,null,197,32.299999999999997,0.09]
[33,25.361000000000001,0.28000000000000003,null,198,32.299999999999997,0.09]
[34,24.805,0.3,null,199,32.299999999999997,0.09]
[35,24.312999999999999,0.32,null,200,32.299999999999997,0.09]
[36,23.811,0.34,null,201,32.299999999999997,0.09]
[37,23.219000000000001,0.37,null,202,32.299999999999997,0.09]
[38,22.655000000000001,0.39,null,203,32.299999999999997,0.09]
[39,22.12,0.44,null,204,31.962,0.1]
[40,21.574000000000002,0.47,null,205,31.962,0.1]
[41,20.888999999999999,0.52,null,206,31.962,0.1]
[42,20.32,0.57999999999999996,null,207,31.962,0.1]
[43,19.739999999999998,0.64,null,208,31.962,0.1]
[44,19.100999999999999,0.71,null,209,31.962,0.1]
[45,18.402000000000001,0.77,null,210,31.962,0.1]
[46,17.785,0.86,null,211,31.962,0.1]
[47,17.106999999999999,0.98,null,212,31.962,0.1]
[48,16.364999999999998,1.0900000000000001,null,213,31.962,0.1]
[49,15.71,1.21,null,214,31.962,0.1]
[50,14.936,1.34,null,215,31.962,0.1]
[51,14.2,1.51,null,216,31.619,0.12]
[52,13.505000000000001,1.68,null,217,31.619,0.12]
[53,12.797000000000001,1.89,null,218,31.619,0.12]
[54,11.901,2.08,null,219,31.619,0.12]
[55,11.161,2.37,null,220,31.619,0.12]
[56,10.345000000000001,2.6,null,221,31.619,0.12]
[57,9.4459999999999997,2.9,null,222,31.619,0.12]
[58,8.6579999999999995,3.24,null,223,31.619,0.12]
[59,7.8529999999999998,3.5,null,224,31.619,0.12]
[60,6.9630000000000001,3.94,null,225,31.619,0.12]
[61,5.9829999999999997,4.29,null,226,31.619,0.12]
[62,5.12,4.8,null,227,31.619,0.12]
[63,4.0910000000000002,5.34,null,228,31.266999999999999,0.15]
[64,3.11,5.88,null,229,31.266999999999999,0.15]
[65,2.1800000000000002,6.51,null,230,31.266999999999999,0.15]
[66,0.98599999999999999,7.15,null,231,31.266999999999999,0.15]
[67,0,7.96,null,232,31.266999999999999,0.15]
[68,0,8.8800000000000008,null,233,31.266999999999999,0.15]
[69,0,9.99,null,234,31.266999999999999,0.15]
[70,0,11.1,null,235,31.266999999999999,0.15]
[71,0,12.52,null,236,31.266999999999999,0.15]
[72,0,13.98,null,237,31.266999999999999,0.15]
[73,0,15.76,null,238,31.266999999999999,0.15]
[74,0,18.07,null,239,31.266999999999999,0.15]
[75,0,20.149999999999999,null,240,30.908999999999999,0.16]
[76,0,23.09,null,241,30.908999999999999,0.16]
[77,0,26.19,null,242,30.908999999999999,0.16]
[78,0,29.89,null,243,30.908999999999999,0.16]
[79,0,34.11,null,244,30.908999999999999,0.16]
[80,0,39.1,null,245,{"$f":"VLOOKUP(ROUNDDOWN($E90/12,0),$A$25:$C$90,2,0)","v":30.908999999999999},{"$f":"VLOOKUP(ROUNDDOWN($E90/12,0),$A$25:$C$90,3,0)","v":0.16}]
[null,null,null,null,246,30.908999999999999,0.16]
[null,null,null,null,247,30.908999999999999,0.16]
[null,null,null,null,248,30.908999999999999,0.16]
[null,null,null,null,249,30.908999999999999,0.16]
[null,null,null,null,250,30.908999999999999,0.16]
[null,null,null,null,251,30.908999999999999,0.16]
[null,null,null,null,252,30.542999999999999,0.17]
[null,null,null,null,253,30.542999999999999,0.17]
[null,null,null,null,254,30.542999999999999,0.17]
[null,null,null,null,255,30.542999999999999,0.17]
[null,null,null,null,256,30.542999999999999,0.17]
[null,null,null,null,257,30.542999999999999,0.17]
[null,null,null,null,258,30.542999999999999,0.17]
[null,null,null,null,259,30.542999999999999,0.17]
[null,null,null,null,260,30.542999999999999,0.17]
[null,null,null,null,261,30.542999999999999,0.17]
[null,null,null,null,262,30.542999999999999,0.17]
[null,null,null,null,263,30.542999999999999,0.17]
[null,null,null,null,264,30.17,0.17]
[null,null,null,null,265,30.17,0.17]
[null,null,null,null,266,30.17,0.17]
[null,null,null,null,267,30.17,0.17]
[null,null,null,null,268,30.17,0.17]
[null,null,null,null,269,30.17,0.17]
[null,null,null,null,270,30.17,0.17]
[null,null,null,null,271,30.17,0.17]
[null,null,null,null,272,30.17,0.17]
[null,null,null,null,273,30.17,0.17]
[null,null,null,null,274,30.17,0.17]
[null,null,null,null,275,30.17,0.17]
{"$rows_left_out":696}